Cyberduck Mountain Duck CLI

Ticket #9711: windows-build-failure-2017-09-27.log

File windows-build-failure-2017-09-27.log, 15.1 KB (added by tjcelaya, on Oct 27, 2017 at 5:30:53 PM)
Line 
1[INFO] --- maven-antrun-plugin:1.8:run (run-ant-target) @ Cyberduck.Bonjour.Native ---
2[WARNING] Parameter tasks is deprecated, use target instead
3[INFO] Executing tasks
4
5main:
6
7timestamp:
8
9init:
10     [echo]
11     [echo]    ---------------------------------------------------------------
12     [echo]    Java Version: 1.8
13     [echo]    Home:      C:\cygwin64\home\Administrator\repo\cyberduck
14     [echo]    Module:  C:\cygwin64\home\Administrator\repo\cyberduck\bonjour\native
15     [echo]    Build Target: C:\cygwin64\home\Administrator\repo\cyberduck\bonjour\native/target
16     [echo]    ---------------------------------------------------------------
17     [echo]
18     [echo] Building Cyberduck Native Libraries on Windows Server 2016/amd64 at 27/10/2017 06:14 PM...
19
20version:
21     [echo] Version 6.3.0
22     [echo] Revision 26720
23     [echo] Hash 77b662ddcea41ef0f7dbb592ec288327cfb4acd1
24
25dll:
26  [msbuild] Microsoft (R) Build Engine version 15.4.8.50001 for .NET Framework
27  [msbuild] Copyright (C) Microsoft Corporation. All rights reserved.
28  [msbuild]
29  [msbuild] Build started 10/27/2017 10:14:41 AM.
30  [msbuild] Project "C:\cygwin64\home\Administrator\repo\cyberduck\Cyberduck Bonjour.csproj" on node 1 (Build target(s)).
31  [msbuild] AssemblyInfo:
32  [msbuild]   Created AssemblyInfo file "bonjour\target\AssemblyInfo.cs".
33  [msbuild] C:\Program Files (x86)\Microsoft Visual Studio\2017\Community\MSBuild\15.0\bin\Microsoft.Common.CurrentVersion.targets(2605,5): warning MSB3284: Cannot get the file path for type library "18fbed6d-f2b7-4ec8-a4a4-46282e635308" version 1.0. Library not registered. (Exception from HRESULT: 0x8002801D (TYPE_E_LIBNOTREGISTERED)) [C:\cygwin64\home\Administrator\repo\cyberduck\Cyberduck Bonjour.csproj]
34  [msbuild] CoreCompile:
35  [msbuild]   C:\Program Files (x86)\Microsoft Visual Studio\2017\Community\MSBuild\15.0\bin\Roslyn\csc.exe /noconfig /unsafe+ /nowarn:1701,1702 /nostdlib+ /platform:x86 /errorreport:prompt /define:TRACE /highentropyva- /reference:C:\cygwin64\home\Administrator\repo\cyberduck\bonjour\dll\target\Cyberduck.Bonjour.dll /reference:C:\cygwin64\home\Administrator\repo\cyberduck\bonjour\native\target\ikvm-8.1.5717.0\bin\IKVM.OpenJDK.Beans.dll /reference:C:\cygwin64\home\Administrator\repo\cyberduck\bonjour\native\target\ikvm-8.1.5717.0\bin\IKVM.OpenJDK.Charsets.dll /reference:C:\cygwin64\home\Administrator\repo\cyberduck\bonjour\native\target\ikvm-8.1.5717.0\bin\IKVM.OpenJDK.Core.dll /reference:C:\cygwin64\home\Administrator\repo\cyberduck\bonjour\native\target\ikvm-8.1.5717.0\bin\IKVM.OpenJDK.Jdbc.dll /reference:C:\cygwin64\home\Administrator\repo\cyberduck\bonjour\native\target\ikvm-8.1.5717.0\bin\IKVM.OpenJDK.Localedata.dll /reference:C:\cygwin64\home\Administrator\repo\cyberduck\bonjour\native\target\ikvm-8.1.5717.0\bin\IKVM.OpenJDK.Security.dll /reference:C:\cygwin64\home\Administrator\repo\cyberduck\bonjour\native\target\ikvm-8.1.5717.0\bin\IKVM.OpenJDK.Text.dll /reference:C:\cygwin64\home\Administrator\repo\cyberduck\bonjour\native\target\ikvm-8.1.5717.0\bin\IKVM.OpenJDK.XML.API.dll /reference:C:\cygwin64\home\Administrator\repo\cyberduck\bonjour\native\target\ikvm-8.1.5717.0\bin\IKVM.OpenJDK.XML.Bind.dll /reference:C:\cygwin64\home\Administrator\repo\cyberduck\bonjour\native\target\ikvm-8.1.5717.0\bin\IKVM.OpenJDK.XML.Parse.dll /reference:C:\cygwin64\home\Administrator\repo\cyberduck\bonjour\native\target\ikvm-8.1.5717.0\bin\IKVM.OpenJDK.XML.Transform.dll /reference:C:\cygwin64\home\Administrator\repo\cyberduck\bonjour\native\target\ikvm-8.1.5717.0\bin\IKVM.OpenJDK.XML.XPath.dll /reference:C:\cygwin64\home\Administrator\repo\cyberduck\bonjour\native\target\ikvm-8.1.5717.0\bin\IKVM.Runtime.dll /reference:C:\cygwin64\home\Administrator\repo\cyberduck\bonjour\native\target\ikvm-8.1.5717.0\bin\IKVM.Runtime.JNI.dll /reference:"C:\Program Files (x86)\Reference Assemblies\Microsoft\Framework\.NETFramework\v4.0\Microsoft.CSharp.dll" /reference:"C:\Program Files (x86)\Reference Assemblies\Microsoft\Framework\.NETFramework\v4.0\Microsoft.VisualBasic.dll" /reference:"C:\Program Files (x86)\Reference Assemblies\Microsoft\Framework\.NETFramework\v4.0\mscorlib.dll" /reference:"C:\Program Files (x86)\Reference Assemblies\Microsoft\Framework\.NETFramework\v4.0\System.Core.dll" /reference:"C:\Program Files (x86)\Reference Assemblies\Microsoft\Framework\.NETFramework\v4.0\System.Data.DataSetExtensions.dll" /reference:"C:\Program Files (x86)\Reference Assemblies\Microsoft\Framework\.NETFramework\v4.0\System.Data.dll" /reference:"C:\Program Files (x86)\Reference Assemblies\Microsoft\Framework\.NETFramework\v4.0\System.dll" /reference:"C:\Program Files (x86)\Reference Assemblies\Microsoft\Framework\.NETFramework\v4.0\System.Drawing.dll" /reference:"C:\Program Files (x86)\Reference Assemblies\Microsoft\Framework\.NETFramework\v4.0\System.Security.dll" /reference:"C:\Program Files (x86)\Reference Assemblies\Microsoft\Framework\.NETFramework\v4.0\System.Windows.Forms.dll" /reference:"C:\Program Files (x86)\Reference Assemblies\Microsoft\Framework\.NETFramework\v4.0\System.Xml.dll" /reference:"C:\Program Files (x86)\Reference Assemblies\Microsoft\Framework\.NETFramework\v4.0\System.Xml.Linq.dll" /debug:pdbonly /filealign:512 /optimize+ /out:obj\x86\release\Cyberduck.Bonjour.Native.dll /ruleset:"C:\Program Files (x86)\Microsoft Visual Studio\2017\Community\Team Tools\Static Analysis Tools\\Rule Sets\MinimumRecommendedRules.ruleset" /target:library /utf8output bonjour\src\main\csharp\ch\cyberduck\core\bonjour\Rendezvous.cs bonjour\target\AssemblyInfo.cs "C:\cygwin64\tmp\.NETFramework,Version=v4.0.AssemblyAttributes.cs"
36  [msbuild]   Using shared compilation with compiler from directory: C:\Program Files (x86)\Microsoft Visual Studio\2017\Community\MSBuild\15.0\bin\Roslyn
37  [msbuild] bonjour\src\main\csharp\ch\cyberduck\core\bonjour\Rendezvous.cs(22,7): error CS0246: The type or namespace name 'Bonjour' could not be found (are you missing a using directive or an assembly reference?) [C:\cygwin64\home\Administrator\repo\cyberduck\Cyberduck Bonjour.csproj]
38  [msbuild] bonjour\src\main\csharp\ch\cyberduck\core\bonjour\Rendezvous.cs(85,34): error CS0246: The type or namespace name 'DNSSDService' could not be found (are you missing a using directive or an assembly reference?) [C:\cygwin64\home\Administrator\repo\cyberduck\Cyberduck Bonjour.csproj]
39  [msbuild] bonjour\src\main\csharp\ch\cyberduck\core\bonjour\Rendezvous.cs(85,56): error CS0246: The type or namespace name 'DNSSDFlags' could not be found (are you missing a using directive or an assembly reference?) [C:\cygwin64\home\Administrator\repo\cyberduck\Cyberduck Bonjour.csproj]
40  [msbuild] bonjour\src\main\csharp\ch\cyberduck\core\bonjour\Rendezvous.cs(91,33): error CS0246: The type or namespace name 'DNSSDService' could not be found (are you missing a using directive or an assembly reference?) [C:\cygwin64\home\Administrator\repo\cyberduck\Cyberduck Bonjour.csproj]
41  [msbuild] bonjour\src\main\csharp\ch\cyberduck\core\bonjour\Rendezvous.cs(91,55): error CS0246: The type or namespace name 'DNSSDFlags' could not be found (are you missing a using directive or an assembly reference?) [C:\cygwin64\home\Administrator\repo\cyberduck\Cyberduck Bonjour.csproj]
42  [msbuild] bonjour\src\main\csharp\ch\cyberduck\core\bonjour\Rendezvous.cs(98,37): error CS0246: The type or namespace name 'DNSSDService' could not be found (are you missing a using directive or an assembly reference?) [C:\cygwin64\home\Administrator\repo\cyberduck\Cyberduck Bonjour.csproj]
43  [msbuild] bonjour\src\main\csharp\ch\cyberduck\core\bonjour\Rendezvous.cs(98,59): error CS0246: The type or namespace name 'DNSSDFlags' could not be found (are you missing a using directive or an assembly reference?) [C:\cygwin64\home\Administrator\repo\cyberduck\Cyberduck Bonjour.csproj]
44  [msbuild] bonjour\src\main\csharp\ch\cyberduck\core\bonjour\Rendezvous.cs(99,67): error CS0246: The type or namespace name 'TXTRecord' could not be found (are you missing a using directive or an assembly reference?) [C:\cygwin64\home\Administrator\repo\cyberduck\Cyberduck Bonjour.csproj]
45  [msbuild] bonjour\src\main\csharp\ch\cyberduck\core\bonjour\Rendezvous.cs(126,37): error CS0246: The type or namespace name 'DNSSDService' could not be found (are you missing a using directive or an assembly reference?) [C:\cygwin64\home\Administrator\repo\cyberduck\Cyberduck Bonjour.csproj]
46  [msbuild] bonjour\src\main\csharp\ch\cyberduck\core\bonjour\Rendezvous.cs(126,59): error CS0246: The type or namespace name 'DNSSDError' could not be found (are you missing a using directive or an assembly reference?) [C:\cygwin64\home\Administrator\repo\cyberduck\Cyberduck Bonjour.csproj]
47  [msbuild] bonjour\src\main\csharp\ch\cyberduck\core\bonjour\Rendezvous.cs(30,45): error CS0246: The type or namespace name 'DNSSDService' could not be found (are you missing a using directive or an assembly reference?) [C:\cygwin64\home\Administrator\repo\cyberduck\Cyberduck Bonjour.csproj]
48  [msbuild] bonjour\src\main\csharp\ch\cyberduck\core\bonjour\Rendezvous.cs(32,17): error CS0246: The type or namespace name 'DNSSDEventManager' could not be found (are you missing a using directive or an assembly reference?) [C:\cygwin64\home\Administrator\repo\cyberduck\Cyberduck Bonjour.csproj]
49  [msbuild] bonjour\src\main\csharp\ch\cyberduck\core\bonjour\Rendezvous.cs(33,17): error CS0246: The type or namespace name 'DNSSDService' could not be found (are you missing a using directive or an assembly reference?) [C:\cygwin64\home\Administrator\repo\cyberduck\Cyberduck Bonjour.csproj]
50  [msbuild] Done Building Project "C:\cygwin64\home\Administrator\repo\cyberduck\Cyberduck Bonjour.csproj" (Build target(s)) -- FAILED.
51  [msbuild]
52  [msbuild] Build FAILED.
53  [msbuild]
54  [msbuild] "C:\cygwin64\home\Administrator\repo\cyberduck\Cyberduck Bonjour.csproj" (Build target) (1) ->
55  [msbuild] (ResolveComReferences target) ->
56  [msbuild]   C:\Program Files (x86)\Microsoft Visual Studio\2017\Community\MSBuild\15.0\bin\Microsoft.Common.CurrentVersion.targets(2605,5): warning MSB3284: Cannot get the file path for type library "18fbed6d-f2b7-4ec8-a4a4-46282e635308" version 1.0. Library not registered. (Exception from HRESULT: 0x8002801D (TYPE_E_LIBNOTREGISTERED)) [C:\cygwin64\home\Administrator\repo\cyberduck\Cyberduck Bonjour.csproj]
57  [msbuild]
58  [msbuild]
59  [msbuild] "C:\cygwin64\home\Administrator\repo\cyberduck\Cyberduck Bonjour.csproj" (Build target) (1) ->
60  [msbuild] (CoreCompile target) ->
61  [msbuild]   bonjour\src\main\csharp\ch\cyberduck\core\bonjour\Rendezvous.cs(22,7): error CS0246: The type or namespace name 'Bonjour' could not be found (are you missing a using directive or an assembly reference?) [C:\cygwin64\home\Administrator\repo\cyberduck\Cyberduck Bonjour.csproj]
62  [msbuild]   bonjour\src\main\csharp\ch\cyberduck\core\bonjour\Rendezvous.cs(85,34): error CS0246: The type or namespace name 'DNSSDService' could not be found (are you missing a using directive or an assembly reference?) [C:\cygwin64\home\Administrator\repo\cyberduck\Cyberduck Bonjour.csproj]
63  [msbuild]   bonjour\src\main\csharp\ch\cyberduck\core\bonjour\Rendezvous.cs(85,56): error CS0246: The type or namespace name 'DNSSDFlags' could not be found (are you missing a using directive or an assembly reference?) [C:\cygwin64\home\Administrator\repo\cyberduck\Cyberduck Bonjour.csproj]
64  [msbuild]   bonjour\src\main\csharp\ch\cyberduck\core\bonjour\Rendezvous.cs(91,33): error CS0246: The type or namespace name 'DNSSDService' could not be found (are you missing a using directive or an assembly reference?) [C:\cygwin64\home\Administrator\repo\cyberduck\Cyberduck Bonjour.csproj]
65  [msbuild]   bonjour\src\main\csharp\ch\cyberduck\core\bonjour\Rendezvous.cs(91,55): error CS0246: The type or namespace name 'DNSSDFlags' could not be found (are you missing a using directive or an assembly reference?) [C:\cygwin64\home\Administrator\repo\cyberduck\Cyberduck Bonjour.csproj]
66  [msbuild]   bonjour\src\main\csharp\ch\cyberduck\core\bonjour\Rendezvous.cs(98,37): error CS0246: The type or namespace name 'DNSSDService' could not be found (are you missing a using directive or an assembly reference?) [C:\cygwin64\home\Administrator\repo\cyberduck\Cyberduck Bonjour.csproj]
67  [msbuild]   bonjour\src\main\csharp\ch\cyberduck\core\bonjour\Rendezvous.cs(98,59): error CS0246: The type or namespace name 'DNSSDFlags' could not be found (are you missing a using directive or an assembly reference?) [C:\cygwin64\home\Administrator\repo\cyberduck\Cyberduck Bonjour.csproj]
68  [msbuild]   bonjour\src\main\csharp\ch\cyberduck\core\bonjour\Rendezvous.cs(99,67): error CS0246: The type or namespace name 'TXTRecord' could not be found (are you missing a using directive or an assembly reference?) [C:\cygwin64\home\Administrator\repo\cyberduck\Cyberduck Bonjour.csproj]
69  [msbuild]   bonjour\src\main\csharp\ch\cyberduck\core\bonjour\Rendezvous.cs(126,37): error CS0246: The type or namespace name 'DNSSDService' could not be found (are you missing a using directive or an assembly reference?) [C:\cygwin64\home\Administrator\repo\cyberduck\Cyberduck Bonjour.csproj]
70  [msbuild]   bonjour\src\main\csharp\ch\cyberduck\core\bonjour\Rendezvous.cs(126,59): error CS0246: The type or namespace name 'DNSSDError' could not be found (are you missing a using directive or an assembly reference?) [C:\cygwin64\home\Administrator\repo\cyberduck\Cyberduck Bonjour.csproj]
71  [msbuild]   bonjour\src\main\csharp\ch\cyberduck\core\bonjour\Rendezvous.cs(30,45): error CS0246: The type or namespace name 'DNSSDService' could not be found (are you missing a using directive or an assembly reference?) [C:\cygwin64\home\Administrator\repo\cyberduck\Cyberduck Bonjour.csproj]
72  [msbuild]   bonjour\src\main\csharp\ch\cyberduck\core\bonjour\Rendezvous.cs(32,17): error CS0246: The type or namespace name 'DNSSDEventManager' could not be found (are you missing a using directive or an assembly reference?) [C:\cygwin64\home\Administrator\repo\cyberduck\Cyberduck Bonjour.csproj]
73  [msbuild]   bonjour\src\main\csharp\ch\cyberduck\core\bonjour\Rendezvous.cs(33,17): error CS0246: The type or namespace name 'DNSSDService' could not be found (are you missing a using directive or an assembly reference?) [C:\cygwin64\home\Administrator\repo\cyberduck\Cyberduck Bonjour.csproj]
74  [msbuild]
75  [msbuild]     1 Warning(s)
76  [msbuild]     13 Error(s)
77  [msbuild]
78  [msbuild] Time Elapsed 00:00:00.75
79[INFO] ------------------------------------------------------------------------
80[INFO] Reactor Summary:
81[INFO]
82[INFO] Cyberduck .......................................... SUCCESS [  3.469 s]
83[INFO] core ............................................... SUCCESS [ 30.812 s]
84[INFO] binding ............................................ SUCCESS [  3.703 s]
85[INFO] test ............................................... SUCCESS [  0.641 s]
86[INFO] Cyberduck.Core ..................................... SUCCESS [ 34.531 s]
87[INFO] Cyberduck.Core.Native .............................. SUCCESS [ 27.844 s]
88[INFO] cryptomator ........................................ SUCCESS [  7.187 s]
89[INFO] Cyberduck.Cryptomator .............................. SUCCESS [ 19.719 s]
90[INFO] bonjour ............................................ SUCCESS [  4.359 s]
91[INFO] Cyberduck.Bonjour .................................. SUCCESS [ 18.828 s]
92[INFO] Cyberduck.Bonjour.Native ........................... FAILURE [  8.328 s]
swiss made software