Cyberduck Mountain Duck CLI

Ticket #9711: windows-build-failure.log

File windows-build-failure.log, 43.2 KB (added by tjcelaya, on Oct 26, 2017 at 1:35:53 AM)

windows-build-failure.log

Line 
1[INFO] Scanning for projects...
2[INFO] ------------------------------------------------------------------------
3[INFO] Reactor Build Order:
4[INFO]
5[INFO] Cyberduck
6[INFO] core
7[INFO] binding
8[INFO] test
9[INFO] Cyberduck.Core
10[INFO] Cyberduck.Core.Native
11[INFO] cryptomator
12[INFO] Cyberduck.Cryptomator
13[INFO] bonjour
14[INFO] Cyberduck.Bonjour
15[INFO] Cyberduck.Bonjour.Native
16[INFO] importer
17[INFO] Cyberduck.Importer
18[INFO] oauth
19[INFO] udt
20[INFO] irods
21[INFO] webdav
22[INFO] s3
23[INFO] spectra
24[INFO] googlestorage
25[INFO] openstack
26[INFO] azure
27[INFO] ssh
28[INFO] ftp
29[INFO] googledrive
30[INFO] backblaze
31[INFO] dropbox
32[INFO] nio
33[INFO] hubic
34[INFO] onedrive
35[INFO] dracoon
36[INFO] protocols
37[INFO] Cyberduck.Protocols
38[INFO] Cyberduck.Native
39[INFO]
40[INFO] ------------------------------------------------------------------------
41[INFO] Building Cyberduck 6.3.0-SNAPSHOT
42[INFO] ------------------------------------------------------------------------
43[INFO]
44[INFO] --- directory-maven-plugin:0.1:execution-root (directories) @ parent ---
45[INFO] Execution-Root set to: C:\Users\Administrator\repo\cyberduck
46[INFO]
47[INFO] --- maven-jgit-buildnumber-plugin:1.2.10:extract-buildnumber (git-buildnumber) @ parent ---
48[INFO] Git info extracted, revision: '77b662d', branch: 'master', tag: '', commitsCount: '26720', commitDate: '2017-10-24', buildnumber: 'master.26720.77b662d'
49[INFO]
50[INFO] >>> maven-source-plugin:3.0.1:jar (attach-sources) > generate-sources @ parent >>>
51[INFO]
52[INFO] --- directory-maven-plugin:0.1:execution-root (directories) @ parent ---
53[INFO] Execution-Root set to: C:\Users\Administrator\repo\cyberduck
54[INFO]
55[INFO] --- maven-jgit-buildnumber-plugin:1.2.10:extract-buildnumber (git-buildnumber) @ parent ---
56[INFO] Git info extracted, revision: '77b662d', branch: 'master', tag: '', commitsCount: '26720', commitDate: '2017-10-24', buildnumber: 'master.26720.77b662d'
57[INFO]
58[INFO] <<< maven-source-plugin:3.0.1:jar (attach-sources) < generate-sources @ parent <<<
59[INFO]
60[INFO]
61[INFO] --- maven-source-plugin:3.0.1:jar (attach-sources) @ parent ---
62[INFO]
63[INFO] --- maven-failsafe-plugin:2.19.1:integration-test (default) @ parent ---
64[INFO] Tests are skipped.
65[INFO]
66[INFO] --- maven-failsafe-plugin:2.19.1:verify (default) @ parent ---
67[INFO] Tests are skipped.
68[INFO]
69[INFO] --- maven-install-plugin:2.5.2:install (default-install) @ parent ---
70[INFO] Installing C:\Users\Administrator\repo\cyberduck\pom.xml to C:\Users\Administrator\.m2\repository\ch\cyberduck\parent\6.3.0-SNAPSHOT\parent-6.3.0-SNAPSHOT.pom
71[INFO]
72[INFO] ------------------------------------------------------------------------
73[INFO] Building core 6.3.0-SNAPSHOT
74[INFO] ------------------------------------------------------------------------
75[INFO]
76[INFO] --- directory-maven-plugin:0.1:execution-root (directories) @ core ---
77[INFO] Execution-Root set to: C:\Users\Administrator\repo\cyberduck
78[INFO]
79[INFO] --- maven-jgit-buildnumber-plugin:1.2.10:extract-buildnumber (git-buildnumber) @ core ---
80[INFO] Git info extracted, revision: '77b662d', branch: 'master', tag: '', commitsCount: '26720', commitDate: '2017-10-24', buildnumber: 'master.26720.77b662d'
81[INFO]
82[INFO] --- maven-resources-plugin:3.0.2:resources (default-resources) @ core ---
83[INFO] Using 'UTF-8' encoding to copy filtered resources.
84[INFO] Copying 2 resources
85[INFO]
86[INFO] --- maven-compiler-plugin:3.6.1:compile (default-compile) @ core ---
87[INFO] Nothing to compile - all classes are up to date
88[INFO]
89[INFO] --- maven-resources-plugin:3.0.2:testResources (default-testResources) @ core ---
90[INFO] Using 'UTF-8' encoding to copy filtered resources.
91[INFO] Copying 25 resources
92[INFO]
93[INFO] --- maven-compiler-plugin:3.6.1:testCompile (default-testCompile) @ core ---
94[INFO] Nothing to compile - all classes are up to date
95[INFO]
96[INFO] --- maven-surefire-plugin:2.19.1:test (default-test) @ core ---
97[INFO] Tests are skipped.
98[INFO]
99[INFO] --- maven-jar-plugin:3.0.2:jar (default-jar) @ core ---
100[INFO]
101[INFO] >>> maven-source-plugin:3.0.1:jar (attach-sources) > generate-sources @ core >>>
102[INFO]
103[INFO] --- directory-maven-plugin:0.1:execution-root (directories) @ core ---
104[INFO] Execution-Root set to: C:\Users\Administrator\repo\cyberduck
105[INFO]
106[INFO] --- maven-jgit-buildnumber-plugin:1.2.10:extract-buildnumber (git-buildnumber) @ core ---
107[INFO] Git info extracted, revision: '77b662d', branch: 'master', tag: '', commitsCount: '26720', commitDate: '2017-10-24', buildnumber: 'master.26720.77b662d'
108[INFO]
109[INFO] <<< maven-source-plugin:3.0.1:jar (attach-sources) < generate-sources @ core <<<
110[INFO]
111[INFO]
112[INFO] --- maven-source-plugin:3.0.1:jar (attach-sources) @ core ---
113[INFO] Building jar: C:\Users\Administrator\repo\cyberduck\core\target\core-6.3.0-SNAPSHOT-sources.jar
114[INFO]
115[INFO] --- maven-jar-plugin:3.0.2:test-jar (default) @ core ---
116[INFO]
117[INFO] --- maven-failsafe-plugin:2.19.1:integration-test (default) @ core ---
118[INFO] Tests are skipped.
119[INFO]
120[INFO] --- maven-failsafe-plugin:2.19.1:verify (default) @ core ---
121[INFO] Tests are skipped.
122[INFO]
123[INFO] --- maven-install-plugin:2.5.2:install (default-install) @ core ---
124[INFO] Installing C:\Users\Administrator\repo\cyberduck\core\target\core-6.3.0-SNAPSHOT.jar to C:\Users\Administrator\.m2\repository\ch\cyberduck\core\6.3.0-SNAPSHOT\core-6.3.0-SNAPSHOT.jar
125[INFO] Installing C:\Users\Administrator\repo\cyberduck\core\pom.xml to C:\Users\Administrator\.m2\repository\ch\cyberduck\core\6.3.0-SNAPSHOT\core-6.3.0-SNAPSHOT.pom
126[INFO] Installing C:\Users\Administrator\repo\cyberduck\core\target\core-6.3.0-SNAPSHOT-sources.jar to C:\Users\Administrator\.m2\repository\ch\cyberduck\core\6.3.0-SNAPSHOT\core-6.3.0-SNAPSHOT-sources.jar
127[INFO] Installing C:\Users\Administrator\repo\cyberduck\core\target\core-6.3.0-SNAPSHOT-tests.jar to C:\Users\Administrator\.m2\repository\ch\cyberduck\core\6.3.0-SNAPSHOT\core-6.3.0-SNAPSHOT-tests.jar
128[INFO]
129[INFO] ------------------------------------------------------------------------
130[INFO] Building binding 6.3.0-SNAPSHOT
131[INFO] ------------------------------------------------------------------------
132[INFO]
133[INFO] --- directory-maven-plugin:0.1:execution-root (directories) @ binding ---
134[INFO] Execution-Root set to: C:\Users\Administrator\repo\cyberduck
135[INFO]
136[INFO] --- maven-jgit-buildnumber-plugin:1.2.10:extract-buildnumber (git-buildnumber) @ binding ---
137[INFO] Git info extracted, revision: '77b662d', branch: 'master', tag: '', commitsCount: '26720', commitDate: '2017-10-24', buildnumber: 'master.26720.77b662d'
138[INFO]
139[INFO] --- maven-resources-plugin:3.0.2:resources (default-resources) @ binding ---
140[INFO] Using 'UTF-8' encoding to copy filtered resources.
141[INFO] skip non existing resourceDirectory C:\Users\Administrator\repo\cyberduck\binding\src\main\resources
142[INFO]
143[INFO] --- maven-compiler-plugin:3.6.1:compile (default-compile) @ binding ---
144[INFO] Nothing to compile - all classes are up to date
145[INFO]
146[INFO] --- maven-resources-plugin:3.0.2:testResources (default-testResources) @ binding ---
147[INFO] Using 'UTF-8' encoding to copy filtered resources.
148[INFO] skip non existing resourceDirectory C:\Users\Administrator\repo\cyberduck\binding\src\test\resources
149[INFO]
150[INFO] --- maven-compiler-plugin:3.6.1:testCompile (default-testCompile) @ binding ---
151[INFO] No sources to compile
152[INFO]
153[INFO] --- maven-surefire-plugin:2.19.1:test (default-test) @ binding ---
154[INFO] Tests are skipped.
155[INFO]
156[INFO] --- maven-jar-plugin:3.0.2:jar (default-jar) @ binding ---
157[INFO]
158[INFO] >>> maven-source-plugin:3.0.1:jar (attach-sources) > generate-sources @ binding >>>
159[INFO]
160[INFO] --- directory-maven-plugin:0.1:execution-root (directories) @ binding ---
161[INFO] Execution-Root set to: C:\Users\Administrator\repo\cyberduck
162[INFO]
163[INFO] --- maven-jgit-buildnumber-plugin:1.2.10:extract-buildnumber (git-buildnumber) @ binding ---
164[INFO] Git info extracted, revision: '77b662d', branch: 'master', tag: '', commitsCount: '26720', commitDate: '2017-10-24', buildnumber: 'master.26720.77b662d'
165[INFO]
166[INFO] <<< maven-source-plugin:3.0.1:jar (attach-sources) < generate-sources @ binding <<<
167[INFO]
168[INFO]
169[INFO] --- maven-source-plugin:3.0.1:jar (attach-sources) @ binding ---
170[INFO] Building jar: C:\Users\Administrator\repo\cyberduck\binding\target\binding-6.3.0-SNAPSHOT-sources.jar
171[INFO]
172[INFO] --- maven-failsafe-plugin:2.19.1:integration-test (default) @ binding ---
173[INFO] Tests are skipped.
174[INFO]
175[INFO] --- maven-failsafe-plugin:2.19.1:verify (default) @ binding ---
176[INFO] Tests are skipped.
177[INFO]
178[INFO] --- maven-install-plugin:2.5.2:install (default-install) @ binding ---
179[INFO] Installing C:\Users\Administrator\repo\cyberduck\binding\target\binding-6.3.0-SNAPSHOT.jar to C:\Users\Administrator\.m2\repository\ch\cyberduck\binding\6.3.0-SNAPSHOT\binding-6.3.0-SNAPSHOT.jar
180[INFO] Installing C:\Users\Administrator\repo\cyberduck\binding\pom.xml to C:\Users\Administrator\.m2\repository\ch\cyberduck\binding\6.3.0-SNAPSHOT\binding-6.3.0-SNAPSHOT.pom
181[INFO] Installing C:\Users\Administrator\repo\cyberduck\binding\target\binding-6.3.0-SNAPSHOT-sources.jar to C:\Users\Administrator\.m2\repository\ch\cyberduck\binding\6.3.0-SNAPSHOT\binding-6.3.0-SNAPSHOT-sources.jar
182[INFO]
183[INFO] ------------------------------------------------------------------------
184[INFO] Building test 6.3.0-SNAPSHOT
185[INFO] ------------------------------------------------------------------------
186[INFO]
187[INFO] --- directory-maven-plugin:0.1:execution-root (directories) @ test ---
188[INFO] Execution-Root set to: C:\Users\Administrator\repo\cyberduck
189[INFO]
190[INFO] --- maven-jgit-buildnumber-plugin:1.2.10:extract-buildnumber (git-buildnumber) @ test ---
191[INFO] Git info extracted, revision: '77b662d', branch: 'master', tag: '', commitsCount: '26720', commitDate: '2017-10-24', buildnumber: 'master.26720.77b662d'
192[INFO]
193[INFO] >>> maven-source-plugin:3.0.1:jar (attach-sources) > generate-sources @ test >>>
194[INFO]
195[INFO] --- directory-maven-plugin:0.1:execution-root (directories) @ test ---
196[INFO] Execution-Root set to: C:\Users\Administrator\repo\cyberduck
197[INFO]
198[INFO] --- maven-jgit-buildnumber-plugin:1.2.10:extract-buildnumber (git-buildnumber) @ test ---
199[INFO] Git info extracted, revision: '77b662d', branch: 'master', tag: '', commitsCount: '26720', commitDate: '2017-10-24', buildnumber: 'master.26720.77b662d'
200[INFO]
201[INFO] <<< maven-source-plugin:3.0.1:jar (attach-sources) < generate-sources @ test <<<
202[INFO]
203[INFO]
204[INFO] --- maven-source-plugin:3.0.1:jar (attach-sources) @ test ---
205[INFO]
206[INFO] --- maven-failsafe-plugin:2.19.1:integration-test (default) @ test ---
207[INFO] Tests are skipped.
208[INFO]
209[INFO] --- maven-failsafe-plugin:2.19.1:verify (default) @ test ---
210[INFO] Tests are skipped.
211[INFO]
212[INFO] --- maven-install-plugin:2.5.2:install (default-install) @ test ---
213[INFO] Installing C:\Users\Administrator\repo\cyberduck\test\pom.xml to C:\Users\Administrator\.m2\repository\ch\cyberduck\test\6.3.0-SNAPSHOT\test-6.3.0-SNAPSHOT.pom
214[INFO]
215[INFO] ------------------------------------------------------------------------
216[INFO] Building Cyberduck.Core 6.3.0-SNAPSHOT
217[INFO] ------------------------------------------------------------------------
218[INFO]
219[INFO] --- directory-maven-plugin:0.1:execution-root (directories) @ Cyberduck.Core ---
220[INFO] Execution-Root set to: C:\Users\Administrator\repo\cyberduck
221[INFO]
222[INFO] --- maven-jgit-buildnumber-plugin:1.2.10:extract-buildnumber (git-buildnumber) @ Cyberduck.Core ---
223[INFO] Git info extracted, revision: '77b662d', branch: 'master', tag: '', commitsCount: '26720', commitDate: '2017-10-24', buildnumber: 'master.26720.77b662d'
224[INFO]
225[INFO] --- maven-dependency-plugin:3.0.0:copy-dependencies (copy-dependencies-dylib-target) @ Cyberduck.Core ---
226[INFO]
227[INFO] --- maven-dependency-plugin:3.0.0:copy-dependencies (copy-dependencies-dll-target) @ Cyberduck.Core ---
228[INFO] Copying sunmscapi-7.0.250.17-native.dll to C:\Users\Administrator\repo\cyberduck\core\dll\target\sunmscapi.dll
229[INFO] Copying sunec-8.0.920.14-native.dll to C:\Users\Administrator\repo\cyberduck\core\dll\target\sunec.dll
230[INFO] Copying jnidispatch-4.2-native.dll to C:\Users\Administrator\repo\cyberduck\core\dll\target\jnidispatch.dll
231[INFO]
232[INFO] --- maven-dependency-plugin:3.0.0:copy-dependencies (copy-dependencies-so-target) @ Cyberduck.Core ---
233[INFO]
234[INFO] --- maven-dependency-plugin:3.0.0:copy-dependencies (copy-dependencies-jar-target) @ Cyberduck.Core ---
235[INFO] commons-io:commons-io:jar:2.5 already exists in destination.
236[INFO] org.apache.httpcomponents:httpclient:jar:4.5.3 already exists in destination.
237[INFO] com.google.code.findbugs:jsr305:jar:1.3.9 already exists in destination.
238[INFO] log4j:log4j:jar:1.2.17 already exists in destination.
239[INFO] org.slf4j:slf4j-log4j12:jar:1.7.25 already exists in destination.
240[INFO] net.java.dev.jna:jna:jar:4.2.2 already exists in destination.
241[INFO] com.google.j2objc:j2objc-annotations:jar:1.1 already exists in destination.
242[INFO] org.codehaus.mojo:animal-sniffer-annotations:jar:1.14 already exists in destination.
243[INFO] org.apache.commons:commons-text:jar:1.1 already exists in destination.
244[INFO] net.java.dev.jna:jna-platform:jar:4.2.2 already exists in destination.
245[INFO] ch.iterate.s3:jets3t:jar:0.9.13 already exists in destination.
246[INFO] org.apache.commons:commons-collections4:jar:4.1 already exists in destination.
247[INFO] javax.activation:activation:jar:1.1.1 already exists in destination.
248[INFO] com.google.code.gson:gson:jar:2.8.2 already exists in destination.
249[INFO] com.google.errorprone:error_prone_annotations:jar:2.0.18 already exists in destination.
250[INFO] commons-codec:commons-codec:jar:1.10 already exists in destination.
251[INFO] net.iharder:base64:jar:2.3.8 already exists in destination.
252[INFO] com.google.guava:guava:jar:23.0 already exists in destination.
253[INFO] com.nulab-inc:zxcvbn:jar:1.2.3 already exists in destination.
254[INFO] org.apache.httpcomponents:httpmime:jar:4.5.3 already exists in destination.
255[INFO] org.apache.httpcomponents:httpcore:jar:4.4.8 already exists in destination.
256[INFO] ch.cyberduck:core:jar:6.3.0-SNAPSHOT already exists in destination.
257[INFO] org.codehaus.jackson:jackson-mapper-asl:jar:1.9.13 already exists in destination.
258[INFO] commons-logging:commons-logging:jar:1.2 already exists in destination.
259[INFO] org.slf4j:slf4j-api:jar:1.7.25 already exists in destination.
260[INFO] com.googlecode.plist:dd-plist:jar:1.20 already exists in destination.
261[INFO] org.codehaus.jackson:jackson-core-asl:jar:1.9.13 already exists in destination.
262[INFO] org.apache.commons:commons-lang3:jar:3.6 already exists in destination.
263[INFO] com.jamesmurty.utils:java-xmlbuilder:jar:1.1 already exists in destination.
264[INFO] org.bouncycastle:bcprov-jdk15on:jar:1.58 already exists in destination.
265[INFO] sunmscapi:sunmscapi:jar:7.0.250.17 already exists in destination.
266[INFO] org.apache.commons:commons-pool2:jar:2.4.2 already exists in destination.
267[INFO] org.bouncycastle:bcpkix-jdk15on:jar:1.58 already exists in destination.
268[INFO] org.slf4j:jul-to-slf4j:jar:1.7.25 already exists in destination.
269[INFO] commons-net:commons-net:jar:3.6 already exists in destination.
270[INFO]
271[INFO] --- maven-dependency-plugin:3.0.0:unpack (unpack-runtime) @ Cyberduck.Core ---
272[INFO] Configured Artifact: net.ikvm:ikvm:8.1.5717.0.patched:zip
273[INFO] ikvm-8.1.5717.0.patched.zip already unpacked.
274[INFO]
275[INFO] --- maven-dependency-plugin:3.0.0:unpack (unpack-jre) @ Cyberduck.Core ---
276[INFO] Configured Artifact: com.oracle.java:jre:8u131:zip
277[INFO] Unpacking C:\Users\Administrator\.m2\repository\com\oracle\java\jre\8u131\jre-8u131.zip to C:\Users\Administrator\repo\cyberduck\core\dll\target with includes "" and excludes "**/*.dylib"
278[INFO]
279[INFO] --- maven-antrun-plugin:1.8:run (run-ant-target) @ Cyberduck.Core ---
280[WARNING] Parameter tasks is deprecated, use target instead
281[INFO] Executing tasks
282
283main:
284
285timestamp:
286
287init:
288     [echo]
289     [echo]    ---------------------------------------------------------------
290     [echo]    Java Version: 1.8
291     [echo]    Home:      C:\Users\Administrator\repo\cyberduck
292     [echo]    Module:  C:\Users\Administrator\repo\cyberduck\core\dll
293     [echo]    Build Target: C:\Users\Administrator\repo\cyberduck\core\dll/target
294     [echo]    ---------------------------------------------------------------
295     [echo]
296     [echo] Building Cyberduck Native Libraries on Windows Server 2016/amd64 at 26/10/2017 01:43 AM...
297
298version:
299     [echo] Version 6.3.0
300     [echo] Revision 26720
301     [echo] Hash 77b662ddcea41ef0f7dbb592ec288327cfb4acd1
302
303dll:
304IKVM.NET Compiler version 8.1.5835.0
305Copyright (C) 2002-2015 Jeroen Frijters
306http://www.ikvm.net/
307
308warning IKVMC0109: Skipping class: "com.sun.activation.registries.LineTokenizer"
309    (class is already available in referenced assembly "IKVM.OpenJDK.Beans, Version=8.1.5835.0, Culture=neutral, PublicKeyToken=null")
310warning IKVMC0109: Skipping class: "com.sun.activation.registries.LogSupport"
311    (class is already available in referenced assembly "IKVM.OpenJDK.Beans, Version=8.1.5835.0, Culture=neutral, PublicKeyToken=null")
312warning IKVMC0109: Skipping class: "com.sun.activation.registries.MailcapFile"
313    (class is already available in referenced assembly "IKVM.OpenJDK.Beans, Version=8.1.5835.0, Culture=neutral, PublicKeyToken=null")
314warning IKVMC0109: Skipping class: "com.sun.activation.registries.MailcapParseException"
315    (class is already available in referenced assembly "IKVM.OpenJDK.Beans, Version=8.1.5835.0, Culture=neutral, PublicKeyToken=null")
316warning IKVMC0109: Skipping class: "com.sun.activation.registries.MailcapTokenizer"
317    (class is already available in referenced assembly "IKVM.OpenJDK.Beans, Version=8.1.5835.0, Culture=neutral, PublicKeyToken=null")
318warning IKVMC0109: Skipping class: "com.sun.activation.registries.MimeTypeEntry"
319    (class is already available in referenced assembly "IKVM.OpenJDK.Beans, Version=8.1.5835.0, Culture=neutral, PublicKeyToken=null")
320warning IKVMC0109: Skipping class: "com.sun.activation.registries.MimeTypeFile"
321    (class is already available in referenced assembly "IKVM.OpenJDK.Beans, Version=8.1.5835.0, Culture=neutral, PublicKeyToken=null")
322warning IKVMC0109: Skipping class: "javax.activation.ActivationDataFlavor"
323    (class is already available in referenced assembly "IKVM.OpenJDK.Beans, Version=8.1.5835.0, Culture=neutral, PublicKeyToken=null")
324warning IKVMC0109: Skipping class: "javax.activation.CommandInfo"
325    (class is already available in referenced assembly "IKVM.OpenJDK.Beans, Version=8.1.5835.0, Culture=neutral, PublicKeyToken=null")
326warning IKVMC0109: Skipping class: "javax.activation.CommandMap"
327    (class is already available in referenced assembly "IKVM.OpenJDK.Beans, Version=8.1.5835.0, Culture=neutral, PublicKeyToken=null")
328warning IKVMC0109: Skipping class: "javax.activation.CommandObject"
329    (class is already available in referenced assembly "IKVM.OpenJDK.Beans, Version=8.1.5835.0, Culture=neutral, PublicKeyToken=null")
330warning IKVMC0109: Skipping class: "javax.activation.DataContentHandler"
331    (class is already available in referenced assembly "IKVM.OpenJDK.Beans, Version=8.1.5835.0, Culture=neutral, PublicKeyToken=null")
332warning IKVMC0109: Skipping class: "javax.activation.DataContentHandlerFactory"
333    (class is already available in referenced assembly "IKVM.OpenJDK.Beans, Version=8.1.5835.0, Culture=neutral, PublicKeyToken=null")
334warning IKVMC0109: Skipping class: "javax.activation.DataHandler$1"
335    (class is already available in referenced assembly "IKVM.OpenJDK.Beans, Version=8.1.5835.0, Culture=neutral, PublicKeyToken=null")
336warning IKVMC0109: Skipping class: "javax.activation.DataHandler"
337    (class is already available in referenced assembly "IKVM.OpenJDK.Beans, Version=8.1.5835.0, Culture=neutral, PublicKeyToken=null")
338warning IKVMC0109: Skipping class: "javax.activation.DataHandlerDataSource"
339    (class is already available in referenced assembly "IKVM.OpenJDK.Beans, Version=8.1.5835.0, Culture=neutral, PublicKeyToken=null")
340warning IKVMC0109: Skipping class: "javax.activation.DataSource"
341    (class is already available in referenced assembly "IKVM.OpenJDK.Beans, Version=8.1.5835.0, Culture=neutral, PublicKeyToken=null")
342warning IKVMC0109: Skipping class: "javax.activation.DataSourceDataContentHandler"
343    (class is already available in referenced assembly "IKVM.OpenJDK.Beans, Version=8.1.5835.0, Culture=neutral, PublicKeyToken=null")
344warning IKVMC0109: Skipping class: "javax.activation.FileDataSource"
345    (class is already available in referenced assembly "IKVM.OpenJDK.Beans, Version=8.1.5835.0, Culture=neutral, PublicKeyToken=null")
346warning IKVMC0109: Skipping class: "javax.activation.FileTypeMap"
347    (class is already available in referenced assembly "IKVM.OpenJDK.Beans, Version=8.1.5835.0, Culture=neutral, PublicKeyToken=null")
348warning IKVMC0109: Skipping class: "javax.activation.MailcapCommandMap"
349    (class is already available in referenced assembly "IKVM.OpenJDK.Beans, Version=8.1.5835.0, Culture=neutral, PublicKeyToken=null")
350warning IKVMC0109: Skipping class: "javax.activation.MimeType"
351    (class is already available in referenced assembly "IKVM.OpenJDK.Beans, Version=8.1.5835.0, Culture=neutral, PublicKeyToken=null")
352warning IKVMC0109: Skipping class: "javax.activation.MimeTypeParameterList"
353    (class is already available in referenced assembly "IKVM.OpenJDK.Beans, Version=8.1.5835.0, Culture=neutral, PublicKeyToken=null")
354warning IKVMC0109: Skipping class: "javax.activation.MimeTypeParseException"
355    (class is already available in referenced assembly "IKVM.OpenJDK.Beans, Version=8.1.5835.0, Culture=neutral, PublicKeyToken=null")
356warning IKVMC0109: Skipping class: "javax.activation.MimetypesFileTypeMap"
357    (class is already available in referenced assembly "IKVM.OpenJDK.Beans, Version=8.1.5835.0, Culture=neutral, PublicKeyToken=null")
358warning IKVMC0109: Skipping class: "javax.activation.ObjectDataContentHandler"
359    (class is already available in referenced assembly "IKVM.OpenJDK.Beans, Version=8.1.5835.0, Culture=neutral, PublicKeyToken=null")
360warning IKVMC0109: Skipping class: "javax.activation.SecuritySupport$1"
361    (class is already available in referenced assembly "IKVM.OpenJDK.Beans, Version=8.1.5835.0, Culture=neutral, PublicKeyToken=null")
362warning IKVMC0109: Skipping class: "javax.activation.SecuritySupport$2"
363    (class is already available in referenced assembly "IKVM.OpenJDK.Beans, Version=8.1.5835.0, Culture=neutral, PublicKeyToken=null")
364warning IKVMC0109: Skipping class: "javax.activation.SecuritySupport$3"
365    (class is already available in referenced assembly "IKVM.OpenJDK.Beans, Version=8.1.5835.0, Culture=neutral, PublicKeyToken=null")
366warning IKVMC0109: Skipping class: "javax.activation.SecuritySupport$4"
367    (class is already available in referenced assembly "IKVM.OpenJDK.Beans, Version=8.1.5835.0, Culture=neutral, PublicKeyToken=null")
368warning IKVMC0109: Skipping class: "javax.activation.SecuritySupport$5"
369    (class is already available in referenced assembly "IKVM.OpenJDK.Beans, Version=8.1.5835.0, Culture=neutral, PublicKeyToken=null")
370warning IKVMC0109: Skipping class: "javax.activation.SecuritySupport"
371    (class is already available in referenced assembly "IKVM.OpenJDK.Beans, Version=8.1.5835.0, Culture=neutral, PublicKeyToken=null")
372warning IKVMC0109: Skipping class: "javax.activation.URLDataSource"
373    (class is already available in referenced assembly "IKVM.OpenJDK.Beans, Version=8.1.5835.0, Culture=neutral, PublicKeyToken=null")
374warning IKVMC0109: Skipping class: "javax.activation.UnsupportedDataTypeException"
375    (class is already available in referenced assembly "IKVM.OpenJDK.Beans, Version=8.1.5835.0, Culture=neutral, PublicKeyToken=null")
376warning IKVMC0100: Class "javax.servlet.ServletContextListener" not found
377warning IKVMC0100: Class "net.sf.cglib.proxy.MethodInterceptor" not found
378warning IKVMC0100: Class "javax.servlet.http.HttpServlet" not found
379warning IKVMC0100: Class "javax.jms.MessageListener" not found
380warning IKVMC0100: Class "javax.mail.Authenticator" not found
381warning IKVMC0117: Emitted java.lang.NoSuchMethodError in "sun.security.ec.ECDSASignature.decodeSignature([B)[B"
382    ("sun.security.util.DerInputStream.<init>([BIIZ)V")
383warning IKVMC0100: Class "org.apache.avalon.framework.logger.Logger" not found
384warning IKVMC0100: Class "org.apache.log.Hierarchy" not found
385warning IKVMC0100: Class "org.apache.log.Logger" not found
386warning IKVMC0100: Class "net.sf.cglib.proxy.Enhancer" not found
387warning IKVMC0100: Class "net.sf.cglib.proxy.Factory" not found
388warning IKVMC0100: Class "org.joda.time.DateTime" not found
389warning IKVMC0100: Class "org.joda.time.ReadableDateTime" not found
390warning IKVMC0100: Class "org.joda.time.ReadableInstant" not found
391warning IKVMC0100: Class "org.joda.time.format.DateTimeFormatter" not found
392warning IKVMC0100: Class "org.joda.time.format.ISODateTimeFormat" not found
393warning IKVMC0100: Class "org.joda.time.DateMidnight" not found
394warning IKVMC0100: Class "org.joda.time.DateTimeZone" not found
395warning IKVMC0100: Class "org.joda.time.LocalDate" not found
396warning IKVMC0100: Class "org.joda.time.LocalDateTime" not found
397warning IKVMC0100: Class "org.joda.time.ReadablePeriod" not found
398warning IKVMC0100: Class "org.joda.time.Period" not found
399warning IKVMC0100: Class "org.joda.time.DateMidnight$Property" not found
400warning IKVMC0100: Class "org.joda.time.LocalDate$Property" not found
401warning IKVMC0100: Class "org.joda.time.LocalDateTime$Property" not found
402warning IKVMC0100: Class "javax.servlet.ServletConfig" not found
403warning IKVMC0100: Class "javax.servlet.ServletException" not found
404warning IKVMC0100: Class "javax.jms.TopicConnectionFactory" not found
405warning IKVMC0100: Class "javax.jms.TopicConnection" not found
406warning IKVMC0100: Class "javax.jms.Topic" not found
407warning IKVMC0100: Class "javax.jms.TopicSession" not found
408warning IKVMC0100: Class "javax.jms.JMSException" not found
409warning IKVMC0100: Class "javax.jms.ObjectMessage" not found
410warning IKVMC0100: Class "javax.jms.TopicPublisher" not found
411warning IKVMC0100: Class "javax.mail.internet.MimeMessage" not found
412warning IKVMC0100: Class "javax.mail.internet.MimeUtility" not found
413warning IKVMC0100: Class "javax.mail.Message" not found
414warning IKVMC0100: Class "javax.mail.MessagingException" not found
415warning IKVMC0100: Class "javax.mail.Message$RecipientType" not found
416warning IKVMC0100: Class "javax.mail.Session" not found
417warning IKVMC0100: Class "javax.mail.internet.InternetAddress" not found
418warning IKVMC0100: Class "javax.mail.internet.AddressException" not found
419warning IKVMC0100: Class "javax.mail.internet.MimeBodyPart" not found
420warning IKVMC0100: Class "javax.mail.internet.InternetHeaders" not found
421warning IKVMC0100: Class "javax.mail.internet.MimeMultipart" not found
422warning IKVMC0100: Class "javax.mail.Multipart" not found
423warning IKVMC0100: Class "javax.mail.Transport" not found
424warning IKVMC0100: Class "javax.jms.Message" not found
425
426build:
427[INFO] Executed tasks
428[INFO]
429[INFO] >>> maven-source-plugin:3.0.1:jar (attach-sources) > generate-sources @ Cyberduck.Core >>>
430[INFO]
431[INFO] --- directory-maven-plugin:0.1:execution-root (directories) @ Cyberduck.Core ---
432[INFO] Execution-Root set to: C:\Users\Administrator\repo\cyberduck
433[INFO]
434[INFO] --- maven-jgit-buildnumber-plugin:1.2.10:extract-buildnumber (git-buildnumber) @ Cyberduck.Core ---
435[INFO] Git info extracted, revision: '77b662d', branch: 'master', tag: '', commitsCount: '26720', commitDate: '2017-10-24', buildnumber: 'master.26720.77b662d'
436[INFO]
437[INFO] --- maven-dependency-plugin:3.0.0:copy-dependencies (copy-dependencies-dylib-target) @ Cyberduck.Core ---
438[INFO]
439[INFO] --- maven-dependency-plugin:3.0.0:copy-dependencies (copy-dependencies-dll-target) @ Cyberduck.Core ---
440[INFO] Copying sunmscapi-7.0.250.17-native.dll to C:\Users\Administrator\repo\cyberduck\core\dll\target\sunmscapi.dll
441[INFO] Copying sunec-8.0.920.14-native.dll to C:\Users\Administrator\repo\cyberduck\core\dll\target\sunec.dll
442[INFO] Copying jnidispatch-4.2-native.dll to C:\Users\Administrator\repo\cyberduck\core\dll\target\jnidispatch.dll
443[INFO]
444[INFO] --- maven-dependency-plugin:3.0.0:copy-dependencies (copy-dependencies-so-target) @ Cyberduck.Core ---
445[INFO]
446[INFO] --- maven-dependency-plugin:3.0.0:copy-dependencies (copy-dependencies-jar-target) @ Cyberduck.Core ---
447[INFO] commons-io:commons-io:jar:2.5 already exists in destination.
448[INFO] org.apache.httpcomponents:httpclient:jar:4.5.3 already exists in destination.
449[INFO] com.google.code.findbugs:jsr305:jar:1.3.9 already exists in destination.
450[INFO] log4j:log4j:jar:1.2.17 already exists in destination.
451[INFO] org.slf4j:slf4j-log4j12:jar:1.7.25 already exists in destination.
452[INFO] net.java.dev.jna:jna:jar:4.2.2 already exists in destination.
453[INFO] com.google.j2objc:j2objc-annotations:jar:1.1 already exists in destination.
454[INFO] org.codehaus.mojo:animal-sniffer-annotations:jar:1.14 already exists in destination.
455[INFO] org.apache.commons:commons-text:jar:1.1 already exists in destination.
456[INFO] net.java.dev.jna:jna-platform:jar:4.2.2 already exists in destination.
457[INFO] ch.iterate.s3:jets3t:jar:0.9.13 already exists in destination.
458[INFO] org.apache.commons:commons-collections4:jar:4.1 already exists in destination.
459[INFO] javax.activation:activation:jar:1.1.1 already exists in destination.
460[INFO] com.google.code.gson:gson:jar:2.8.2 already exists in destination.
461[INFO] com.google.errorprone:error_prone_annotations:jar:2.0.18 already exists in destination.
462[INFO] commons-codec:commons-codec:jar:1.10 already exists in destination.
463[INFO] net.iharder:base64:jar:2.3.8 already exists in destination.
464[INFO] com.google.guava:guava:jar:23.0 already exists in destination.
465[INFO] com.nulab-inc:zxcvbn:jar:1.2.3 already exists in destination.
466[INFO] org.apache.httpcomponents:httpmime:jar:4.5.3 already exists in destination.
467[INFO] org.apache.httpcomponents:httpcore:jar:4.4.8 already exists in destination.
468[INFO] ch.cyberduck:core:jar:6.3.0-SNAPSHOT already exists in destination.
469[INFO] org.codehaus.jackson:jackson-mapper-asl:jar:1.9.13 already exists in destination.
470[INFO] commons-logging:commons-logging:jar:1.2 already exists in destination.
471[INFO] org.slf4j:slf4j-api:jar:1.7.25 already exists in destination.
472[INFO] com.googlecode.plist:dd-plist:jar:1.20 already exists in destination.
473[INFO] org.codehaus.jackson:jackson-core-asl:jar:1.9.13 already exists in destination.
474[INFO] org.apache.commons:commons-lang3:jar:3.6 already exists in destination.
475[INFO] com.jamesmurty.utils:java-xmlbuilder:jar:1.1 already exists in destination.
476[INFO] org.bouncycastle:bcprov-jdk15on:jar:1.58 already exists in destination.
477[INFO] sunmscapi:sunmscapi:jar:7.0.250.17 already exists in destination.
478[INFO] org.apache.commons:commons-pool2:jar:2.4.2 already exists in destination.
479[INFO] org.bouncycastle:bcpkix-jdk15on:jar:1.58 already exists in destination.
480[INFO] org.slf4j:jul-to-slf4j:jar:1.7.25 already exists in destination.
481[INFO] commons-net:commons-net:jar:3.6 already exists in destination.
482[INFO]
483[INFO] --- maven-dependency-plugin:3.0.0:unpack (unpack-runtime) @ Cyberduck.Core ---
484[INFO] Configured Artifact: net.ikvm:ikvm:8.1.5717.0.patched:zip
485[INFO] ikvm-8.1.5717.0.patched.zip already unpacked.
486[INFO]
487[INFO] --- maven-dependency-plugin:3.0.0:unpack (unpack-jre) @ Cyberduck.Core ---
488[INFO] Configured Artifact: com.oracle.java:jre:8u131:zip
489[INFO] Unpacking C:\Users\Administrator\.m2\repository\com\oracle\java\jre\8u131\jre-8u131.zip to C:\Users\Administrator\repo\cyberduck\core\dll\target with includes "" and excludes "**/*.dylib"
490[INFO]
491[INFO] <<< maven-source-plugin:3.0.1:jar (attach-sources) < generate-sources @ Cyberduck.Core <<<
492[INFO]
493[INFO]
494[INFO] --- maven-source-plugin:3.0.1:jar (attach-sources) @ Cyberduck.Core ---
495[INFO]
496[INFO] --- maven-failsafe-plugin:2.19.1:integration-test (default) @ Cyberduck.Core ---
497[INFO] Tests are skipped.
498[INFO]
499[INFO] --- maven-failsafe-plugin:2.19.1:verify (default) @ Cyberduck.Core ---
500[INFO] Tests are skipped.
501[INFO]
502[INFO] --- build-helper-maven-plugin:1.10:attach-artifact (install-dll) @ Cyberduck.Core ---
503[INFO]
504[INFO] --- maven-install-plugin:2.5.2:install (default-install) @ Cyberduck.Core ---
505[INFO] Installing C:\Users\Administrator\repo\cyberduck\core\dll\pom.xml to C:\Users\Administrator\.m2\repository\ch\cyberduck\Cyberduck.Core\6.3.0-SNAPSHOT\Cyberduck.Core-6.3.0-SNAPSHOT.pom
506[INFO] Installing C:\Users\Administrator\repo\cyberduck\core\dll\target\Cyberduck.Core.dll to C:\Users\Administrator\.m2\repository\ch\cyberduck\Cyberduck.Core\6.3.0-SNAPSHOT\Cyberduck.Core-6.3.0-SNAPSHOT.dll
507[INFO]
508[INFO] ------------------------------------------------------------------------
509[INFO] Building Cyberduck.Core.Native 6.3.0-SNAPSHOT
510[INFO] ------------------------------------------------------------------------
511[INFO]
512[INFO] --- directory-maven-plugin:0.1:execution-root (directories) @ Cyberduck.Core.Native ---
513[INFO] Execution-Root set to: C:\Users\Administrator\repo\cyberduck
514[INFO]
515[INFO] --- maven-jgit-buildnumber-plugin:1.2.10:extract-buildnumber (git-buildnumber) @ Cyberduck.Core.Native ---
516[INFO] Git info extracted, revision: '77b662d', branch: 'master', tag: '', commitsCount: '26720', commitDate: '2017-10-24', buildnumber: 'master.26720.77b662d'
517[INFO]
518[INFO] --- maven-dependency-plugin:3.0.0:copy-dependencies (copy-dependencies-dylib-target) @ Cyberduck.Core.Native ---
519[INFO]
520[INFO] --- maven-dependency-plugin:3.0.0:copy-dependencies (copy-dependencies-dll-target) @ Cyberduck.Core.Native ---
521[INFO] Copying Cyberduck.Core.dll to C:\Users\Administrator\repo\cyberduck\core\native\target\Cyberduck.Core.dll
522[INFO] Copying sunmscapi-7.0.250.17-native.dll to C:\Users\Administrator\repo\cyberduck\core\native\target\sunmscapi.dll
523[INFO] Copying msvcp120-12.0.21005.1-native.dll to C:\Users\Administrator\repo\cyberduck\core\native\target\msvcp120.dll
524[INFO] Copying nunit.framework-2.6.4.14350-native.dll to C:\Users\Administrator\repo\cyberduck\core\native\target\nunit.framework.dll
525[INFO] Copying sunec-8.0.920.14-native.dll to C:\Users\Administrator\repo\cyberduck\core\native\target\sunec.dll
526[INFO] Copying msvcr120-12.0.21005.1-native.dll to C:\Users\Administrator\repo\cyberduck\core\native\target\msvcr120.dll
527[INFO] Copying msvcr100-10.0.40219.325-native.dll to C:\Users\Administrator\repo\cyberduck\core\native\target\msvcr100.dll
528[INFO] Copying jnidispatch-4.2-native.dll to C:\Users\Administrator\repo\cyberduck\core\native\target\jnidispatch.dll
529[INFO] Copying vccorlib120-12.0.21005.1-native.dll to C:\Users\Administrator\repo\cyberduck\core\native\target\vccorlib120.dll
530[INFO]
531[INFO] --- maven-dependency-plugin:3.0.0:copy-dependencies (copy-dependencies-so-target) @ Cyberduck.Core.Native ---
532[INFO]
533[INFO] --- maven-dependency-plugin:3.0.0:copy-dependencies (copy-dependencies-jar-target) @ Cyberduck.Core.Native ---
534[INFO] commons-io:commons-io:jar:2.5 already exists in destination.
535[INFO] org.apache.httpcomponents:httpclient:jar:4.5.3 already exists in destination.
536[INFO] com.google.code.findbugs:jsr305:jar:1.3.9 already exists in destination.
537[INFO] log4j:log4j:jar:1.2.17 already exists in destination.
538[INFO] org.slf4j:slf4j-log4j12:jar:1.7.25 already exists in destination.
539[INFO] net.java.dev.jna:jna:jar:4.2.2 already exists in destination.
540[INFO] com.google.j2objc:j2objc-annotations:jar:1.1 already exists in destination.
541[INFO] org.codehaus.mojo:animal-sniffer-annotations:jar:1.14 already exists in destination.
542[INFO] org.apache.commons:commons-text:jar:1.1 already exists in destination.
543[INFO] net.java.dev.jna:jna-platform:jar:4.2.2 already exists in destination.
544[INFO] ch.iterate.s3:jets3t:jar:0.9.13 already exists in destination.
545[INFO] org.apache.commons:commons-collections4:jar:4.1 already exists in destination.
546[INFO] javax.activation:activation:jar:1.1.1 already exists in destination.
547[INFO] com.google.code.gson:gson:jar:2.8.2 already exists in destination.
548[INFO] com.google.errorprone:error_prone_annotations:jar:2.0.18 already exists in destination.
549[INFO] commons-codec:commons-codec:jar:1.10 already exists in destination.
550[INFO] net.iharder:base64:jar:2.3.8 already exists in destination.
551[INFO] com.google.guava:guava:jar:23.0 already exists in destination.
552[INFO] com.nulab-inc:zxcvbn:jar:1.2.3 already exists in destination.
553[INFO] org.apache.httpcomponents:httpmime:jar:4.5.3 already exists in destination.
554[INFO] org.apache.httpcomponents:httpcore:jar:4.4.8 already exists in destination.
555[INFO] ch.cyberduck:core:jar:6.3.0-SNAPSHOT already exists in destination.
556[INFO] org.codehaus.jackson:jackson-mapper-asl:jar:1.9.13 already exists in destination.
557[INFO] commons-logging:commons-logging:jar:1.2 already exists in destination.
558[INFO] org.slf4j:slf4j-api:jar:1.7.25 already exists in destination.
559[INFO] com.googlecode.plist:dd-plist:jar:1.20 already exists in destination.
560[INFO] org.codehaus.jackson:jackson-core-asl:jar:1.9.13 already exists in destination.
561[INFO] org.apache.commons:commons-lang3:jar:3.6 already exists in destination.
562[INFO] com.jamesmurty.utils:java-xmlbuilder:jar:1.1 already exists in destination.
563[INFO] org.bouncycastle:bcprov-jdk15on:jar:1.58 already exists in destination.
564[INFO] sunmscapi:sunmscapi:jar:7.0.250.17 already exists in destination.
565[INFO] org.apache.commons:commons-pool2:jar:2.4.2 already exists in destination.
566[INFO] org.bouncycastle:bcpkix-jdk15on:jar:1.58 already exists in destination.
567[INFO] org.slf4j:jul-to-slf4j:jar:1.7.25 already exists in destination.
568[INFO] commons-net:commons-net:jar:3.6 already exists in destination.
569[INFO]
570[INFO] --- maven-dependency-plugin:3.0.0:unpack (unpack-runtime) @ Cyberduck.Core.Native ---
571[INFO] Configured Artifact: net.ikvm:ikvm:8.1.5717.0.patched:zip
572[INFO] ikvm-8.1.5717.0.patched.zip already unpacked.
573[INFO]
574[INFO] --- maven-antrun-plugin:1.8:run (run-ant-target) @ Cyberduck.Core.Native ---
575[WARNING] Parameter tasks is deprecated, use target instead
576[INFO] Executing tasks
577
578main:
579
580timestamp:
581
582init:
583     [echo]
584     [echo]    ---------------------------------------------------------------
585     [echo]    Java Version: 1.8
586     [echo]    Home:      C:\Users\Administrator\repo\cyberduck
587     [echo]    Module:  C:\Users\Administrator\repo\cyberduck\core\native
588     [echo]    Build Target: C:\Users\Administrator\repo\cyberduck\core\native/target
589     [echo]    ---------------------------------------------------------------
590     [echo]
591     [echo] Building Cyberduck Native Libraries on Windows Server 2016/amd64 at 26/10/2017 01:43 AM...
592
593version:
594     [echo] Version 6.3.0
595     [echo] Revision 26720
596     [echo] Hash 77b662ddcea41ef0f7dbb592ec288327cfb4acd1
597
598nuget:
599     [exec] MSBuild auto-detection: using msbuild version '4.0' from 'C:\Windows\Microsoft.NET\Framework64\v4.0.30319'.
600     [exec] All packages listed in packages.config are already installed.
601
602dll:
603  [msbuild] Microsoft (R) Build Engine version 4.7.2558.0
604  [msbuild] [Microsoft .NET Framework, version 4.0.30319.42000]
605  [msbuild] Copyright (C) Microsoft Corporation. All rights reserved.
606  [msbuild]
607  [msbuild] Build started 10/25/2017 5:44:01 PM.
608  [msbuild] Project "C:\Users\Administrator\repo\cyberduck\Cyberduck Core.csproj" on node 1 (Build target(s)).
609  [msbuild] C:\Users\Administrator\repo\cyberduck\Cyberduck Core.csproj(211,3): error MSB4019: The imported project "C:\Program Files (x86)\MSBuild\MSBuildCommunityTasks\MSBuild.Community.Tasks.targets" was not found. Confirm that the path in the <Import> declaration is correct, and that the file exists on disk.
610  [msbuild] Done Building Project "C:\Users\Administrator\repo\cyberduck\Cyberduck Core.csproj" (Build target(s)) -- FAILED.
611  [msbuild]
612  [msbuild] Build FAILED.
613  [msbuild]
614  [msbuild] "C:\Users\Administrator\repo\cyberduck\Cyberduck Core.csproj" (Build target) (1) ->
615  [msbuild]   C:\Users\Administrator\repo\cyberduck\Cyberduck Core.csproj(211,3): error MSB4019: The imported project "C:\Program Files (x86)\MSBuild\MSBuildCommunityTasks\MSBuild.Community.Tasks.targets" was not found. Confirm that the path in the <Import> declaration is correct, and that the file exists on disk.
616  [msbuild]
617  [msbuild]     0 Warning(s)
618  [msbuild]     1 Error(s)
619  [msbuild]
620  [msbuild] Time Elapsed 00:00:00.09
621[INFO] ------------------------------------------------------------------------
622[INFO] Reactor Summary:
623[INFO]
624[INFO] Cyberduck .......................................... SUCCESS [  3.110 s]
625[INFO] core ............................................... SUCCESS [  8.343 s]
626[INFO] binding ............................................ SUCCESS [  2.063 s]
627[INFO] test ............................................... SUCCESS [  1.000 s]
628[INFO] Cyberduck.Core ..................................... SUCCESS [ 37.343 s]
629[INFO] Cyberduck.Core.Native .............................. FAILURE [  4.672 s]
630[INFO] cryptomator ........................................ SKIPPED
631[INFO] Cyberduck.Cryptomator .............................. SKIPPED
632[INFO] bonjour ............................................ SKIPPED
633[INFO] Cyberduck.Bonjour .................................. SKIPPED
634[INFO] Cyberduck.Bonjour.Native ........................... SKIPPED
635[INFO] importer ........................................... SKIPPED
636[INFO] Cyberduck.Importer ................................. SKIPPED
637[INFO] oauth .............................................. SKIPPED
638[INFO] udt ................................................ SKIPPED
639[INFO] irods .............................................. SKIPPED
640[INFO] webdav ............................................. SKIPPED
641[INFO] s3 ................................................. SKIPPED
642[INFO] spectra ............................................ SKIPPED
643[INFO] googlestorage ...................................... SKIPPED
644[INFO] openstack .......................................... SKIPPED
645[INFO] azure .............................................. SKIPPED
646[INFO] ssh ................................................ SKIPPED
647[INFO] ftp ................................................ SKIPPED
648[INFO] googledrive ........................................ SKIPPED
649[INFO] backblaze .......................................... SKIPPED
650[INFO] dropbox ............................................ SKIPPED
651[INFO] nio ................................................ SKIPPED
652[INFO] hubic .............................................. SKIPPED
653[INFO] onedrive ........................................... SKIPPED
654[INFO] dracoon ............................................ SKIPPED
655[INFO] protocols .......................................... SKIPPED
656[INFO] Cyberduck.Protocols ................................ SKIPPED
657[INFO] Cyberduck.Native ................................... SKIPPED
658[INFO] ------------------------------------------------------------------------
659[INFO] BUILD FAILURE
660[INFO] ------------------------------------------------------------------------
661[INFO] Total time: 57.765 s
662[INFO] Finished at: 2017-10-25T17:44:02-07:00
663[INFO] Final Memory: 37M/547M
664[INFO] ------------------------------------------------------------------------
665[ERROR] Failed to execute goal org.apache.maven.plugins:maven-antrun-plugin:1.8:run (run-ant-target) on project Cyberduck.Core.Native: An Ant BuildException has occured: The following error occurred while executing this line:
666[ERROR] C:\Users\Administrator\repo\cyberduck\core\native\build.xml:46: null returned: 1
667[ERROR] around Ant part ...<ant antfile="C:\Users\Administrator\repo\cyberduck\core\native/build.xml" dir="." target="build"/>... @ 9:102 in C:\Users\Administrator\repo\cyberduck\core\native\target\antrun\build-main.xml
668[ERROR] -> [Help 1]
669[ERROR]
670[ERROR] To see the full stack trace of the errors, re-run Maven with the -e switch.
671[ERROR] Re-run Maven using the -X switch to enable full debug logging.
672[ERROR]
673[ERROR] For more information about the errors and possible solutions, please read the following articles:
674[ERROR] [Help 1] http://cwiki.apache.org/confluence/display/MAVEN/MojoExecutionException
675[ERROR]
676[ERROR] After correcting the problems, you can resume the build with the command
677[ERROR]   mvn <goals> -rf :Cyberduck.Core.Native
678
swiss made software